KnowledgeHub
Questions
Tags
Users
Search
Alex Rivera
|
Logout
Edit Question
Title
Body
I get the following error when running make , and I have no idea what it means or what to do about it. Can anyone illuminate me or point me in the right direction? (cd libdvdnav-git && patch -p1) < ../../contrib/src/dvdnav/dvdnav.patch patching file Makefile.am Hunk #1 FAILED at 1. 1 out of 1 hunk FAILED -- saving rejects to file Makefile.am.rej make: *** [dvdnav] Error 1 I'm trying to cross compile VLC for win32 (using linux).
Tags (comma-separated)
Save Edits
Cancel