10
I'm trying to compile a Java web app that I'm writing, and I"m getting compile errors that I'm not sure what to do with. From the googling I've done, I found this SO question, but the asker is using EJB, while my error is in a JPA entity class.
Here's the maven build error.
[INFO] ------------------------------------------------------------------------
[INFO] BUILD FAILURE
[INFO] ------------------------------------------------------------------------
[INFO] Total time: 3.988s
[INFO] Finished at: Mon Jun 24 02:39:51 UTC 2013
[INFO] Final Memory: 15M/247M
[INFO] ------------------------------------------------------------------------
[ERROR] Failed to execute goal org.apache.maven.plugins:maven-compiler-plugin:2.3.2:compile (default-compile) on project donebox: Compilation failure: Compilation failure:
[ERROR] /home/cl-server/builder/tomcat-ide-builder/temp/build-1236514164814552082/src/main/java/net/donebox/accounts/User.java:[50,4] error: annotation type not applicable to this kind of declaration
[ERROR] /home/cl-server/builder/tomcat-ide-builder/temp/build-1236514164814552082/src/main/java/net/donebox/accounts/User.java:[60,4] error: annotation type not applicable to this kind of declaration
[ERROR] /home/cl-server/builder/tomcat-ide-builder/temp/build-1236514164814552082/src/main/java/net/donebox/accounts/Role.java:[53,4] error: annotation type not applicable to this kind of declaration
[ERROR] -> [Help 1]
[ERROR]
[ERROR] To see the full stack trace of the errors, re-run Maven with the -e switch.
[ERROR] Re-run Maven using the -X switch to enable full debug logging.
[ERROR]
[ERROR] For more information about the errors and possible solutions, please read the following articles:
[ERROR] [Help 1] http://cwiki.apache.org/confluence/display/MAVEN/MojoFailureException
And here's my User class file.