KnowledgeHub
Questions
Tags
Users
Search
Alex Rivera
|
Logout
Edit Question
Title
Body
Upgrading to Rails 3 by starting with RVM 1.8.7. OSX 10.5.8 Output: josh-crewss-macbook:~ joshcrews$ gem install sqlite3-rubyBuilding native extensions. This could take a while...ERROR: Error installing sqlite3-ruby: ERROR: Failed to build gem native extension. /Users/joshcrews/.rvm/rubies/ruby-1.8.7-p174/bin/ruby extconf.rb checking for sqlite3.h... yes checking for sqlite3_libversion_number() in -lsqlite3... yes checking for rb_proc_arity()... no checking for sqlite3_column_database_name()... no checking for sqlite3_enable_load_extension()... no checking for sqlite3_load_extension()... no creating Makefile make gcc -I. -I. -I/Users/joshcrews/.rvm/rubies/ruby-1.8.7-p174/lib/ruby/1.8/i686-darwin9.8.0 -I. -I/usr/local/include -I/opt/local/include -I/usr/include -D_XOPEN_SOURCE -D_DARWIN_C_SOURCE -fno-common -g -O2 -fno-common -pipe -fno-common -O3 -Wall -Wcast-qual -Wwrite-strings -Wconversion -Wmissing-noreturn -Winline -c database.c database.c: In function ‘deallocate’: database.c:17: warning: implicit declaration of function ‘sqlite3_next_stmt’ database.c:17: warning: assignment makes pointer from integer without a cast database.c: In function ‘initialize’: database.c:76: warning: implicit declaration of function ‘sqlite3_open_v2’ database.c:79: error: ‘SQLITE_OPEN_READWRITE’ undeclared (first use in this function) database.c:79: error: (Each undeclared identifier is reported only once database.c:79: error: for each function it appears in.) database.c:79: error: ‘SQLITE_OPEN_CREATE’ undeclared (first use in this function) database.c: In function ‘set_sqlite3_func_result’: database.c:277: error: ‘sqlite3_int64’ undeclared (first use in this function) database.c: In function ‘rb_sqlite3_func’: database.c:311: warning: passing argument 1 of ‘ruby_xcalloc’ as signed due to prototype database.c: In function ‘rb_sqlite3_step’: database.c:378: warning: passing argument 1 of ‘ruby_xcalloc’ as signed due to prototype make: *** [database.o] Err
Tags (comma-separated)
Save Edits
Cancel