KnowledgeHub
Questions
Tags
Users
Search
Alex Rivera
|
Logout
Edit Question
Title
Body
When I run maven test, java.lang.OutOfMemoryError happens. I googled it for solutions and have tried to export MAVEN_OPTS=-Xmx1024m , but it did not work. Anyone know other solutions for this problem? I am using maven 3.0 Paste the error message here when run mvn test -e Failed tests: warning(junit.framework.TestSuite$1) testDefaultPigJob_1(com.snda.dw.pig.impl.DefaultPigJobLocalTest) testDefaultPigJob_2(com.snda.dw.pig.impl.DefaultPigJobLocalTest) Tests run: 11, Failures: 3, Errors: 0, Skipped: 0 10/11/01 13:37:18 INFO executionengine.HExecutionEngine: Connecting to hadoop fi le system at: file:/// [INFO] ------------------------------------------------------------------------ [INFO] BUILD FAILURE [INFO] ------------------------------------------------------------------------ [INFO] Total time: 30.063s [INFO] Finished at: Mon Nov 01 13:37:18 PDT 2010 [INFO] Final Memory: 3M/6M [INFO] ------------------------------------------------------------------------ [ERROR] Failed to execute goal org.apache.maven.plugins:maven-surefire-plugin:2. 5:test (default-test) on project dw.pig: There are test failures. [ERROR] [ERROR] Please refer to E:\Code\Java\workspace\dw.pig\target\surefire-reports fo r the individual test results. [ERROR] -> [Help 1] org.apache.maven.lifecycle.LifecycleExecutionException: Failed to execute goal o rg.apache.maven.plugins:maven-surefire-plugin:2.5:test (default-test) on project dw.pig: There are test failures. Please refer to E:\Code\Java\workspace\dw.pig\target\surefire-reports for the in dividual test results. at org.apache.maven.lifecycle.internal.MojoExecutor.execute(MojoExecutor .java:199) at org.apache.maven.lifecycle.internal.MojoExecutor.execute(MojoExecutor .java:148) at org.apache.maven.lifecycle.internal.MojoExecutor.execute(MojoExecutor .java:140) at org.apache.maven.lifecycle.internal.LifecycleModuleBuilder.buildProje ct(LifecycleModule
Tags (comma-separated)
Save Edits
Cancel